{"text_format":"1","workbook":"xlsx","n_sheets":6,"sheets":["加入情報入力用","世帯情報入力用","試算結果","世帯賦課条件","試算年度条件","各年度 料率"],"not_rendered":{"charts":0,"images":0,"macros":1,"external_links":0,"defined_names":2,"comments":0,"pivot_tables":0},"unopened":[],"bounds":{"document_bytes":16777216,"sheet_cells":100000,"rows_first":2000,"rows_last":500,"rows_between":2000,"halvings":0,"cell_chars":16384,"cell_head_chars":4096},"cells_cut":0,"cells_raw":0,"read":"whole","date_system":"1900"}

{"sheet":"加入情報入力用","index":0,"n_rows":33,"n_cols":3,"rows_kept":33,"cut":false,"hidden":true,"merged":[[0,0,0,1],[3,0,3,1]]}
["加入情報"]
[]
["過年度試算 ","次年度試算 "]
["↑現年度試算はチェック不要↑"]
["年度",{"$f":"IF(世帯情報入力用!A4=\"\",\"\",世帯情報入力用!A4)","v":7}]
["開始月",4]
["終了月",3]
["手続き月",null,{"$f":"IF(B17=TRUE,\"←入力不要\",\"\")","v":""}]
[]
["保険料額",{"$f":"IF(OR(B6=\"\",B7=\"\"),\"\",ROUNDDOWN(世帯賦課条件!B31*(B21-B20+1)/12,0))","v":0}]
{"$rows_left_out":24}
{"sheet":"世帯情報入力用","index":1,"n_rows":25,"n_cols":31,"rows_kept":25,"cut":false,"hidden":false,"merged":[[0,0,1,0],[4,0,5,0],[6,0,7,0],[17,19,17,22],[18,19,18,22],[9,3,10,4],[2,1,3,2],[2,3,3,4],[6,1,7,2],[16,1,16,4],[17,1,17,4],[18,1,18,4],[12,7,12,8],[13,7,13,8],[14,7,14,8],[11,3,11,4],[12,3,12,4],[13,3,13,4],[14,3,14,4],[15,1,15,4],[6,3,7,4],[8,7,8,8],[8,9,8,10],[9,9,10,10],[15,25,15,28],[16,25,16,28],[17,25,17,28],[15,19,15,22],[16,19,16,22],[18,25,18,28],[2,25,3,26],[2,27,3,28],[6,25,7,26],[6,27,7,28],[8,25,8,26],[8,27,8,28],[9,25,9,26],[2,19,3,20],[2,21,3,22],[6,19,7,20],[6,21,7,22],[13,27,13,28],[14,27,14,28],[12,25,12,26],[13,25,13,26],[14,25,14,26],[10,25,10,26],[11,25,11,26],[2,13,3,14],[8,13,8,14],[15,13,15,16],[16,13,16,16],[17,13,17,16],[18,13,18,16],[2,7,3,8],[2,9,3,10],[21,1,21,2],[17,7,17,10],[18,7,18,10],[6,7,7,8],[6,9,7,10],[12,9,12,10],[13,9,13,10],[14,9,14,10],[15,7,15,10],[16,7,16,10],[11,9,11,10],[9,7,9,8],[10,7,10,8],[11,7,11,8],[9,1,9,2],[10,1,10,2],[13,13,13,14],[14,13,14,14],[8,15,8,16],[9,13,9,14],[10,13,10,14],[11,13,11,14],[12,15,12,16],[24,1,24,2],[12,1,12,2],[13,1,13,2],[14,1,14,2],[22,1,22,2],[23,1,23,2],[11,1,11,2],[8,1,8,2],[8,3,8,4],[9,27,10,28],[11,27,11,28],[12,27,12,28],[2,15,3,16],[6,13,7,14],[6,15,7,16],[12,19,12,20],[13,19,13,20],[14,19,14,20],[12,21,12,22],[13,21,13,22],[14,21,14,22],[8,19,8,20],[8,21,8,22],[9,19,9,20],[10,19,10,20],[11,19,11,20],[9,21,10,22],[11,21,11,22],[13,15,13,16],[14,15,14,16],[9,15,10,16],[11,15,11,16],[12,13,12,14]]}
["保険料試算"]
[]
["年度","加入者1",null,{"$f":"IF(OR(B6=\"\",C6=\"\",D6=\"\",E6=\"\"),\"4月末  歳\",\"4月末 \"&G17&\"歳\")","v":"4月末  歳"},null,"今年度→西暦",{"$f":"IF($A$4=\"\",\"\",$A$4+2018)","v":2025},"加入者2",null,{"$f":"IF(OR(H6=\"\",I6=\"\",J6=\"\",K6=\"\"),\"4月末  歳\",\"4月末 \"&M17&\"歳\")","v":"4月末  歳"},null,"今年度→西暦",{"$f":"IF($A$4=\"\",\"\",$A$4+2018)","v":2025},"加入者3",null,{"$f":"IF(OR(N6=\"\",O6=\"\",P6=\"\",Q6=\"\"),\"4月末  歳\",\"4月末 \"&S17&\"歳\")","v":"4月末  歳"},null,"今年度→西暦",{"$f":"IF($A$4=\"\",\"\",$A$4+2018)","v":2025},"加入者4",null,{"$f":"IF(OR(T6=\"\",U6=\"\",V6=\"\",W6=\"\"),\"4月末  歳\",\"4月末 \"&Y17&\"歳\")","v":"4月末  歳"},null,"今年度→西暦",{"$f":"IF($A$4=\"\",\"\",$A$4+2018)","v":2025},"加入者5",null,{"$f":"IF(OR(Z6=\"\",AA6=\"\",AB6=\"\",AC6=\"\"),\"4月末  歳\",\"4月末点 \"&AE17&\"歳\")","v":"4月末  歳"},null,"今年度→西暦",{"$f":"IF($A$4=\"\",\"\",$A$4+2018)","v":2025}]
[7,null,null,null,null,"西暦変換",{"$f":"IF(B6=\"西暦\",C6,IF(B6=\"昭和\",C6+1925,IF(B6=\"平成\",C6+1988,IF(B6=\"令和\",C6+2018,\"\"))))","v":""},null,null,null,null,"西暦変換",{"$f":"IF(H6=\"西暦\",I6,IF(H6=\"昭和\",I6+1925,IF(H6=\"平成\",I6+1988,IF(H6=\"令和\",I6+2018,\"\"))))","v":""},null,null,null,null,"西暦変換",{"$f":"IF(N6=\"西暦\",O6,IF(N6=\"昭和\",O6+1925,IF(N6=\"平成\",O6+1988,IF(N6=\"令和\",O6+2018,\"\"))))","v":""},null,null,null,null,"西暦変換",{"$f":"IF(T6=\"西暦\",U6,IF(T6=\"昭和\",U6+1925,IF(T6=\"平成\",U6+1988,IF(T6=\"令和\",U6+2018,\"\"))))","v":""},null,null,null,null,"西暦変換",{"$f":"IF(Z6=\"西暦\",AA6,IF(Z6=\"昭和\",AA6+1925,IF(Z6=\"平成\",AA6+1988,IF(Z6=\"令和\",AA6+2018,\"\"))))","v":""}]
["生年月日","暦","年","月","日","未就学児",{"$f":"IF(OR(B6=\"\",C6=\"\",D6=\"\",E6=\"\"),\"FALSE\",IF(AND(G17>=0,G17<6),\"TRUE\",\"FALSE\"))","v":"FALSE"},"暦","年","月","日","未就学児",{"$f":"IF(OR(H6=\"\",I6=\"\",J6=\"\",K6=\"\"),\"FALSE\",IF(AND(M17>=0,M17<6),\"TRUE\",\"FALSE\"))","v":"FALSE"},"暦","年","月","日","未就学児",{"$f":"IF(OR(N6=\"\",O6=\"\",P6=\"\",Q6=\"\"),\"FALSE\",IF(AND(S17>=0,S17<6),\"TRUE\",\"FALSE\"))","v":"FALSE"},"暦","年","月","日","未就学児",{"$f":"IF(OR(T6=\"\",U6=\"\",V6=\"\",W6=\"\"),\"FALSE\",IF(AND(Y17>=0,Y17<6),\"TRUE\",\"FALSE\"))","v":"FALSE"},"暦","年","月","日","未就学児",{"$f":"IF(OR(Z6=\"\",AA6=\"\",AB6=\"\",AC6=\"\"),\"FALSE\",IF(AND(AE17>=0,AE17<6),\"TRUE\",\"FALSE\"))","v":"FALSE"}]
[null,null,null,null,null,"介護非該当",{"$f":"IF(OR(B6=\"\",C6=\"\",D6=\"\",E6=\"\"),\"FALSE\",IF(AND(G17>=6,G17<40),\"TRUE\",\"FALSE\"))","v":"FALSE"},null,null,null,null,"介護非該当",{"$f":"IF(OR(H6=\"\",I6=\"\",J6=\"\",K6=\"\"),\"FALSE\",IF(AND(M17>=6,M17<40),\"TRUE\",\"FALSE\"))","v":"FALSE"},null,null,null,null,"介護非該当",{"$f":"IF(OR(N6=\"\",O6=\"\",P6=\"\",Q6=\"\"),\"FALSE\",IF(AND(S17>=6,S17<40),\"TRUE\",\"FALSE\"))","v":"FALSE"},null,null,null,null,"介護非該当",{"$f":"IF(OR(T6=\"\",U6=\"\",V6=\"\",W6=\"\"),\"FALSE\",IF(AND(Y17>=6,Y17<40),\"TRUE\",\"FALSE\"))","v":"FALSE"},null,null,null,null,"介護非該当",{"$f":"IF(OR(Z6=\"\",AA6=\"\",AB6=\"\",AC6=\"\"),\"FALSE\",IF(AND(AE17>=6,AE17<40),\"TRUE\",\"FALSE\"))","v":"FALSE"}]
["加入事由","転入",null,null,null,"介護該当",{"$f":"IF(OR(B6=\"\",C6=\"\",D6=\"\",E6=\"\"),\"FALSE\",IF(AND(G17>=40,G17<65),\"TRUE\",\"FALSE\"))","v":"FALSE"},null,null,null,null,"介護該当",{"$f":"IF(OR(H6=\"\",I6=\"\",J6=\"\",K6=\"\"),\"FALSE\",IF(AND(M17>=40,M17<65),\"TRUE\",\"FALSE\"))","v":"FALSE"},null,null,null,null,"介護該当",{"$f":"IF(OR(N6=\"\",O6=\"\",P6=\"\",Q6=\"\"),\"FALSE\",IF(AND(S17>=40,S17<65),\"TRUE\",\"FALSE\"))","v":"FALSE"},null,null,null,null,"介護該当",{"$f":"IF(OR(T6=\"\",U6=\"\",V6=\"\",W6=\"\"),\"FALSE\",IF(AND(Y17>=40,Y17<65),\"TRUE\",\"FALSE\"))","v":"FALSE"},null,null,null,null,"介護該当",{"$f":"IF(OR(Z6=\"\",AA6=\"\",AB6=\"\",AC6=\"\"),\"FALSE\",IF(AND(AE17>=40,AE17<65),\"TRUE\",\"FALSE\"))","v":"FALSE"}]
[null,null,null,null,null,"65歳以上",{"$f":"IF(OR(B6=\"\",C6=\"\",D6=\"\",E6=\"\"),\"FALSE\",IF(AND(G17>=65,G17<75),\"TRUE\",\"FALSE\"))","v":"FALSE"},null,null,null,null,"65歳以上",{"$f":"IF(OR(H6=\"\",I6=\"\",J6=\"\",K6=\"\"),\"FALSE\",IF(AND(M17>=65,M17<75),\"TRUE\",\"FALSE\"))","v":"FALSE"},null,null,null,null,"65歳以上",{"$f":"IF(OR(N6=\"\",O6=\"\",P6=\"\",Q6=\"\"),\"FALSE\",IF(AND(S17>=65,S17<75),\"TRUE\",\"FALSE\"))","v":"FALSE"},null,null,null,null,"65歳以上",{"$f":"IF(OR(T6=\"\",U6=\"\",V6=\"\",W6=\"\"),\"FALSE\",IF(AND(Y17>=65,Y17<75),\"TRUE\",\"FALSE\"))","v":"FALSE"},null,null,null,null,"65歳以上",{"$f":"IF(OR(Z6=\"\",AA6=\"\",AB6=\"\",AC6=\"\"),\"FALSE\",IF(AND(AE17>=65,AE17<75),\"TRUE\",\"FALSE\"))","v":"FALSE"}]
[null,"収入金額",null,"所得金額",null,"給与所得者等",{"$f":"IF(OR(G11>0,(D12-G12)>0),1,0)","v":0},"収入金額",null,"所得金額",null,"給与所得者等",{"$f":"IF(OR(M11>0,(J12-M12)>0),1,0)","v":0},"収入金額",null,"所得金額",null,"給与所得者等",{"$f":"IF(OR(S11>0,(P12-S12)>0),1,0)","v":0},"収入金額",null,"所得金額",null,"給与所得者等",{"$f":"IF(OR(Y11>0,(V12-Y12)>0),1,0)","v":0},"収入金額",null,"所得金額",null,"給与所得者等",{"$f":"IF(OR(AE11>0,(AB12-AE12)>0),1,0)","v":0}]
["給与収入",null,null,{"$f":"G10-G13","v":0},null,"給与所得(専給含む)",{"$f":"IF(G15=\"TRUE\",0.3*(IF(B10+B11<551000,0,IF(B10+B11<1619000,B10+B11-550000,IF(B10+B11<1620000,1069000,IF(B10+B11<1622000,1070000,IF(B10+B11<1624000,1072000,IF(B10+B11<1628000,1074000,IF(B10+B11<1800000,INT(INT((B10+B11)/4000)*4000*0.6)+100000,IF(B10+B11<3600000,INT(INT((B10+B11)/4000)*4000*0.7)-80000,IF(B10+B11<6600000,INT(INT((B10+B11)/4000)*4000*0.8)-440000,IF(B10+B11<8500000,INT((B10+B11)*0.9)-1100000,B10+B11-1950000))))))))))),IF(B10+B11<551000,0,IF(B10+B11<1619000,B10+B11-550000,IF(B10+B11<1620000,1069000,IF(B10+B11<1622000,1070000,IF(B10+B11<1624000,1072000,IF(B10+B11<1628000,1074000,IF(B10+B11<1800000,INT(INT((B10+B11)/4000)*4000*0.6)+100000,IF(B10+B11<3600000,INT(INT((B10+B11)/4000)*4000*0.7)-80000,IF(B10+B11<6600000,INT(INT((B10+B11)/4000)*4000*0.8)-440000,IF(B10+B11<8500000,INT((B10+B11)*0.9)-1100000,B10+B11-1950000)))))))))))","v":0},null,null,{"$f":"M10-M13","v":0},null,"給与所得(専給含む)",{"$f":"IF(M15=\"TRUE\",0.3*(IF(H10+H11<551000,0,IF(H10+H11<1619000,H10+H11-550000,IF(H10+H11<1620000,1069000,IF(H10+H11<1622000,1070000,IF(H10+H11<1624000,1072000,IF(H10+H11<1628000,1074000,IF(H10+H11<1800000,INT(INT((H10+H11)/4000)*4000*0.6)+100000,IF(H10+H11<3600000,INT(INT((H10+H11)/4000)*4000*0.7)-80000,IF(H10+H11<6600000,INT(INT((H10+H11)/4000)*4000*0.8)-440000,IF(H10+H11<8500000,INT((H10+H11)*0.9)-1100000,H10+H11-1950000))))))))))),IF(H10+H11<551000,0,IF(H10+H11<1619000,H10+H11-550000,IF(H10+H11<1620000,1069000,IF(H10+H11<1622000,1070000,IF(H10+H11<1624000,1072000,IF(H10+H11<1628000,1074000,IF(H10+H11<1800000,INT(INT((H10+H11)/4000)*4000*0.6)+100000,IF(H10+H11<3600000,INT(INT((H10+H11)/4000)*4000*0.7)-80000,IF(H10+H11<6600000,INT(INT((H10+H11)/4000)*4000*0.8)-440000,IF(H10+H11<8500000,INT((H10+H11)*0.9)-1100000,H10+H11-1950000)))))))))))","v":0},null,null,{"$f":"S10-S13","v":0},null,"給与所得(専給含む)",{"$f":"IF(S15=\"TRUE\",0.3*(IF(N10+N11<551000,0,IF(N10+N11<1619000,N10+N11-550000,IF(N10+N11<1620000,1069000,IF(N10+N11<1622000,1070000,IF(N10+N11<1624000,1072000,IF(N10+N11<1628000,1074000,IF(N10+N11<1800000,INT(INT((N10+N11)/4000)*4000*0.6)+100000,IF(N10+N11<3600000,INT(INT((N10+N11)/4000)*4000*0.7)-80000,IF(N10+N11<6600000,INT(INT((N10+N11)/4000)*4000*0.8)-440000,IF(N10+N11<8500000,INT((N10+N11)*0.9)-1100000,N10+N11-1950000))))))))))),IF(N10+N11<551000,0,IF(N10+N11<1619000,N10+N11-550000,IF(N10+N11<1620000,1069000,IF(N10+N11<1622000,1070000,IF(N10+N11<1624000,1072000,IF(N10+N11<1628000,1074000,IF(N10+N11<1800000,INT(INT((N10+N11)/4000)*4000*0.6)+100000,IF(N10+N11<3600000,INT(INT((N10+N11)/4000)*4000*0.7)-80000,IF(N10+N11<6600000,INT(INT((N10+N11)/4000)*4000*0.8)-440000,IF(N10+N11<8500000,INT((N10+N11)*0.9)-1100000,N10+N11-1950000)))))))))))","v":0},null,null,{"$f":"Y10-Y13","v":0},null,"給与所得(専給含む)",{"$f":"IF(Y15=\"TRUE\",0.3*(IF(T10+T11<551000,0,IF(T10+T11<1619000,T10+T11-550000,IF(T10+T11<1620000,1069000,IF(T10+T11<1622000,1070000,IF(T10+T11<1624000,1072000,IF(T10+T11<1628000,1074000,IF(T10+T11<1800000,INT(INT((T10+T11)/4000)*4000*0.6)+100000,IF(T10+T11<3600000,INT(INT((T10+T11)/4000)*4000*0.7)-80000,IF(T10+T11<6600000,INT(INT((T10+T11)/4000)*4000*0.8)-440000,IF(T10+T11<8500000,INT((T10+T11)*0.9)-1100000,T10+T11-1950000))))))))))),IF(T10+T11<551000,0,IF(T10+T11<1619000,T10+T11-550000,IF(T10+T11<1620000,1069000,IF(T10+T11<1622000,1070000,IF(T10+T11<1624000,1072000,IF(T10+T11<1628000,1074000,IF(T10+T11<1800000,INT(INT((T10+T11)/4000)*4000*0.6)+100000,IF(T10+T11<3600000,INT(INT((T10+T11)/4000)*4000*0.7)-80000,IF(T10+T11<6600000,INT(INT((T10+T11)/4000)*4000*0.8)-440000,IF(T10+T11<8500000,INT((T10+T11)*0.9)-1100000,T10+T11-1950000)))))))))))","v":0},null,null,{"$f":"AE10-AE13","v":0},null,"給与所得(専給含む)",{"$f":"IF(AE15=\"TRUE\",0.3*(IF(Z10+Z11<551000,0,IF(Z10+Z11<1619000,Z10+Z11-550000,IF(Z10+Z11<1620000,1069000,IF(Z10+Z11<1622000,1070000,IF(Z10+Z11<1624000,1072000,IF(Z10+Z11<1628000,1074000,IF(Z10+Z11<1800000,INT(INT((Z10+Z11)/4000)*4000*0.6)+100000,IF(Z10+Z11<3600000,INT(INT((Z10+Z11)/4000)*4000*0.7)-80000,IF(Z10+Z11<6600000,INT(INT((Z10+Z11)/4000)*4000*0.8)-440000,IF(Z10+Z11<8500000,INT((Z10+Z11)*0.9)-1100000,Z10+Z11-1950000))))))))))),IF(Z10+Z11<551000,0,IF(Z10+Z11<1619000,Z10+Z11-550000,IF(Z10+Z11<1620000,1069000,IF(Z10+Z11<1622000,1070000,IF(Z10+Z11<1624000,1072000,IF(Z10+Z11<1628000,1074000,IF(Z10+Z11<1800000,INT(INT((Z10+Z11)/4000)*4000*0.6)+100000,IF(Z10+Z11<3600000,INT(INT((Z10+Z11)/4000)*4000*0.7)-80000,IF(Z10+Z11<6600000,INT(INT((Z10+Z11)/4000)*4000*0.8)-440000,IF(Z10+Z11<8500000,INT((Z10+Z11)*0.9)-1100000,Z10+Z11-1950000)))))))))))","v":0}]
{"$rows_left_out":16}
{"sheet":"試算結果","index":2,"n_rows":27,"n_cols":18,"rows_kept":27,"cut":false,"hidden":false,"merged":[[3,14,3,16],[5,1,5,4],[5,5,5,7],[7,1,7,4],[27,1,27,21],[22,1,22,21],[23,1,23,21],[25,1,25,21],[26,1,26,21],[19,1,19,21],[20,1,20,21],[0,17,0,21],[21,1,21,21],[24,1,24,21],[7,5,7,7],[9,1,9,4],[10,3,10,5],[10,6,10,8],[5,8,5,15],[13,1,13,21],[14,1,14,21],[15,1,15,21],[16,1,17,21],[1,0,1,21],[10,11,10,12],[3,0,3,1],[3,5,3,6]]}
[null,null,null,null,null,null,null,null,null,null,null,null,null,null,null,null,null,{"$f":"TODAY()","v":"2025-04-15"}]
["保険料試算"]
[]
["令和",null,{"$f":"IF(加入情報入力用!B5=\"\",\"\",加入情報入力用!B5)","v":7},"年度",null,"(令和",null,{"$f":"IF(加入情報入力用!B5=\"\",\"\",加入情報入力用!B5)","v":7},"年 4 月～令和",null,null,null,null,{"$f":"IF(加入情報入力用!B5=\"\",\"\",加入情報入力用!B5+1)","v":8},"年 3 月)"]
[]
[null,{"$f":"IF(加入情報入力用!B10=\"\",\"\",加入情報入力用!B10)","v":0},null,null,null,"円／年",null,null,{"$f":"IF(AND(加入情報入力用!B6=\"\",加入情報入力用!B7=\"\"),\"(   月分～   月分)\",IF(加入情報入力用!B6=加入情報入力用!B7,\"( \"&加入情報入力用!B6&\" 月分)\",\"( \"&加入情報入力用!B6&\" 月分～ \"&加入情報入力用!B7&\" 月分)\"))","v":"( 4 月分～ 3 月分)"}]
[]
[null,{"$f":"IF(加入情報入力用!B10=\"\",\"\",加入情報入力用!B10/(加入情報入力用!B21-加入情報入力用!B20+1))","v":0},null,null,null,"円／月"]
[]
[null,"月支払額"]
{"$rows_left_out":18}
{"sheet":"世帯賦課条件","index":3,"n_rows":32,"n_cols":9,"rows_kept":32,"cut":false,"hidden":true,"merged":[[24,1,24,5],[0,0,0,7],[2,0,2,1],[3,0,3,1],[18,1,18,5],[21,1,21,5]]}
["賦課明細"]
[]
["給与所得者等 人数",null,{"$f":"世帯情報入力用!G9+世帯情報入力用!M9+世帯情報入力用!S9+世帯情報入力用!Y9+世帯情報入力用!AE9","v":0}]
["世帯被保険者数",null,{"$f":"世帯情報入力用!B22","v":0}]
[]
[null,"7割軽減","5割軽減","2割軽減",null,null,null,"当該世帯軽減率"]
["軽減判定額",{"$f":"IF(C3=0,430000,430000+((C3-1)*100000))","v":430000},{"$f":"IF(C3=0,430000+(試算年度条件!B4*世帯賦課条件!C4),430000+(試算年度条件!B4*世帯賦課条件!C4)+((C3-1)*100000))","v":430000},{"$f":"IF(C3=0,430000+(試算年度条件!B5*世帯賦課条件!C4),430000+(試算年度条件!B5*世帯賦課条件!C4)+((C3-1)*100000))","v":430000},null,null,null,{"$f":"IF(世帯情報入力用!A4=\"\",\"\",IF(I7=0.3,\"7割軽減\",IF(I7=0.5,\"5割軽減\",IF(I7=0.8,\"2割軽減\",\"軽減なし\"))))","v":"7割軽減"},{"$f":"IF(世帯情報入力用!B24<=世帯賦課条件!B7,0.3,IF(世帯情報入力用!B24<=世帯賦課条件!C7,0.5,IF(世帯情報入力用!B24<=世帯賦課条件!D7,0.8,1)))","v":0.3}]
[]
[null,"所得割率","均等割額","平等割額","賦課限度額"]
["医療",{"$f":"試算年度条件!B6","v":9.2999999999999999E-2},{"$f":"試算年度条件!B7","v":34424},{"$f":"試算年度条件!B8","v":33574},{"$f":"試算年度条件!B9","v":650000}]
{"$rows_left_out":23}
{"sheet":"試算年度条件","index":4,"n_rows":17,"n_cols":2,"rows_kept":17,"cut":false,"hidden":true,"merged":[[2,0,2,1],[0,0,0,1]]}
[{"$f":"世帯情報入力用!A4","v":7}]
[]
["試算年度条件"]
["5割",{"$f":"VLOOKUP(世帯情報入力用!A4,'各年度 料率'!$A$2:$O$9,2,0)","v":305000}]
["2割",{"$f":"VLOOKUP(世帯情報入力用!A4,'各年度 料率'!$A$2:$O$9,3,0)","v":560000}]
["医療 所得割率",{"$f":"VLOOKUP(世帯情報入力用!A4,'各年度 料率'!$A$2:$O$9,4,0)","v":9.2999999999999999E-2}]
["医療 均等割額",{"$f":"VLOOKUP(世帯情報入力用!A4,'各年度 料率'!$A$2:$O$9,5,0)","v":34424}]
["医療 平等割額",{"$f":"VLOOKUP(世帯情報入力用!A4,'各年度 料率'!$A$2:$O$9,6,0)","v":33574}]
["医療 限度額",{"$f":"VLOOKUP(世帯情報入力用!A4,'各年度 料率'!$A$2:$O$9,7,0)","v":650000}]
["支援 所得割率",{"$f":"VLOOKUP(世帯情報入力用!A4,'各年度 料率'!$A$2:$O$9,8,0)","v":3.0200000000000001E-2}]
{"$rows_left_out":8}
{"sheet":"各年度 料率","index":5,"n_rows":9,"n_cols":15,"rows_kept":9,"cut":false,"hidden":true,"merged":[]}
["年度","5割","2割","医療 所得割率","医療 均等割額","医療 平等割額","医療 限度額","支援 所得割率","支援 均等割額","支援 平等割額","支援 限度額","介護 所得割率","介護 均等割額","介護 平等割額","介護 限度額"]
[3,285000,520000,8.48E-2,30157,31368,630000,2.7300000000000001E-2,9478,9858,190000,2.47E-2,18213,0,170000]
[4,285000,520000,8.7099999999999997E-2,31854,32105,630000,2.6599999999999999E-2,9426,9500,190000,2.4799999999999999E-2,18306,0,170000]
[5,290000,535000,8.8599999999999998E-2,32948,32750,650000,2.76E-2,9945,9886,200000,2.6100000000000002E-2,19552,0,170000]
[6,295000,545000,9.5600000000000004E-2,35040,34803,650000,3.1199999999999999E-2,11167,11091,220000,2.64E-2,19389,0,170000]
[7,305000,560000,9.2999999999999999E-2,34424,33574,650000,3.0200000000000001E-2,11034,10761,240000,2.5600000000000001E-2,18784,0,170000]
[8]
[9]
[10]